Start a new topic

Failed compile from git on Debian 3.11.10 amd64

Download from git - run make fails with:


  1. /home/peter/solo6x10/solo6x10-v4l2.c:846:15: error: ‘struct video_device’ has no member named ‘parent’

  2. solo_dev->vfd->parent = &solo_dev->pdev->dev;

  3. ^

  4. make[4]: *** [/home/peter/solo6x10/solo6x10-v4l2.o] Error 1

  5. make[3]: *** [_module_/home/peter/solo6x10] Error 2

  6. make[2]: *** [sub-make] Error 2

  7. make[1]: *** [all] Error 2

  8. make[1]: Leaving directory `/usr/src/linux-headers-3.11-2-amd64'

Full details here...

http://pastebin.com/FqUryGEq

Thanks,

Pete

Login or Signup to post a comment